{"text_format":"1","workbook":"xlsx","n_sheets":12,"sheets":["SIGNATURE","INSTRUCTIONS","RENTAL_INCOME","RENTAL_EXPENSES","RENTAL_PREDEVELOPMENT_BUDGET","RENTAL_DEVELOPMENT_BUDGET","RENTAL_SOURCES","RENTAL_PRO_FORMA","LIHTC_ELIGIBLE_BASIS","LIHTC_EQUITY","DHCD_UNDERWRITING_STANDARDS","DHCD_UNDERWRITING_BUDGET"],"not_rendered":{"charts":0,"images":1,"macros":1,"external_links":0,"defined_names":22,"comments":2,"pivot_tables":0},"unopened":[],"bounds":{"document_bytes":16777216,"sheet_cells":100000,"rows_first":2000,"rows_last":500,"rows_between":2000,"halvings":0,"cell_chars":16384,"cell_head_chars":4096},"cells_cut":0,"cells_raw":0,"read":"whole","date_system":"1900"}

{"sheet":"SIGNATURE","index":0,"n_rows":45,"n_cols":16,"rows_kept":45,"cut":false,"hidden":false,"merged":[[44,15,44,16],[15,7,15,14],[18,7,18,14],[4,0,4,17],[2,0,2,17],[3,0,3,17],[6,7,6,14],[9,7,9,14],[12,7,12,14],[29,2,29,8],[26,10,26,13],[29,10,29,13],[26,2,26,8],[21,8,21,15],[44,3,44,5]]}
[]
["DEVELOPMENT FINANCE DIVISION"]
["FINANCING  APPLICATION"]
["FORM 202"]
["Application Cover Page"]
[]
[null,null,"Funding Round",null,null,null,null,"Summer 2018 Consolidated RFP"]
[]
[]
[null,null,"Project Type",null,null,null,null,"New Construction Rental"]
[]
[]
[null,null,"LIHTC Funding Requested?",null,null,null,null,"No"]
[]
[]
[null,null,"Organization Name"]
[]
[]
[null,null,"Project Title"]
[]
{"$rows_left_out":26}
{"sheet":"INSTRUCTIONS","index":1,"n_rows":1,"n_cols":1,"rows_kept":1,"cut":false,"hidden":false,"merged":[]}
["FORM 202 INSTRUCTIONS"]

{"sheet":"RENTAL_INCOME","index":2,"n_rows":85,"n_cols":13,"rows_kept":85,"cut":false,"hidden":false,"merged":[[57,0,57,8]]}
[null,null,0.3,0.5,0.6,0.8,"Market","Studio","1 Bedroom","2 Bedroom","3 Bedroom","4 Bedroom","5 Bedroom"]
["PROJECT INCOME"]
[]
["RESIDENTIAL INCOME"]
["Unit Description",null,"Median","Number of","Unit Size","Tenant Paid","Contract","Rent","Income per","Monthly","Annual"]
["Bedrooms","Baths","Income","Units","(Net leasable SF)","Utilities*","Rent","Subsidy","Unit","Income","Income"]
[null,null,null,null,null,null,null,null,{"$f":"G7-F7+H7","v":0},{"$f":"D7*I7","v":0},{"$f":"J7*12","v":0}]
[null,null,null,null,null,null,null,null,{"$f":"G8-F8+H8","v":0},{"$f":"D8*I8","v":0},{"$f":"J8*12","v":0}]
[null,null,null,null,null,null,null,null,0,0,0]
[null,null,null,null,0,null,0,0,0,0,0]
[null,null,null,null,0,null,0,null,0,0,{"$f":"J11*12","v":0}]
[null,null,null,null,null,null,null,null,0,{"$f":"D12*I12","v":0},{"$f":"J12*12","v":0}]
[null,null,null,null,null,null,null,null,0,{"$f":"D13*I13","v":0},0]
[null,null,null,null,null,null,null,null,0,0,0]
[null,null,null,null,null,null,null,null,0,0,0]
[null,null,null,null,null,null,null,null,0,0,0]
[null,null,null,null,null,null,null,null,0,0,0]
[null,null,null,null,null,null,null,null,0,0,0]
[null,null,null,null,null,null,null,null,0,0,0]
[null,null,null,null,null,null,null,null,0,0,0]
{"$rows_left_out":66}
{"sheet":"RENTAL_EXPENSES","index":3,"n_rows":83,"n_cols":6,"rows_kept":83,"cut":false,"hidden":false,"merged":[[1,0,1,5],[2,3,2,4],[2,0,2,1],[4,0,4,2],[43,0,43,2]]}
["Contract","Quote","Developer estimate"]
["PROJECT EXPENSES"]
["Total Residential Units:",null,{"$f":"RENTAL_INCOME!D32","v":0},"Total Gross Square Footage:",null,{"$f":"RENTAL_INCOME!C42","v":0}]
["ADMINISTRATIVE EXPENSES"]
["Expenses",null,null,"Total Cost","Cost per sq. ft.","Cost per Unit"]
["Advertising and Marketing",null,null,null,{"$f":"IF($F$3=0,0,D6/$F$3)","v":0},{"$f":"IF($C$3=0,0,D6/$C$3)","v":0}]
["Office Salaries",null,null,null,0,0]
["Office Supplies",null,null,null,0,0]
["Office or Model Apartment Rent",null,null,null,0,0]
["Management Fee:                                                                        EGI x rate of",0.06,null,{"$f":"RENTAL_INCOME!K55*RENTAL_EXPENSES!B10","v":0},0,0]
["Manager or Superintendent Rent Free Unit",null,null,null,0,0]
["Legal Expenses (project only)",null,null,null,0,0]
["Auditing Expenses (project only)",null,null,null,0,0]
["Bookkeeping Fees and Accounting Services",null,null,null,0,0]
["Telephone and Answering Services",null,null,null,0,0]
["Bad Debts",null,null,null,0,0]
["Miscellaneous Administrative Expenses (describe):",null,null,null,0,0]
["Annual Tax Credit Monitoring Fee ($45.00/tax credit unit)",null,null,null,0,0]
["Other Administrative Expenses 1",null,null,null,0,0]
["Other Administrative Expenses 2",null,null,null,0,0]
{"$rows_left_out":64}
{"sheet":"RENTAL_PREDEVELOPMENT_BUDGET","index":4,"n_rows":124,"n_cols":8,"rows_kept":124,"cut":false,"hidden":false,"merged":[[12,0,12,3],[4,0,4,1]]}
["DHCD- PREDEVELOPMENT BUDGET"]
[null,null,null,null,null,"Total Gross Square Footage:",null,{"$f":"RENTAL_INCOME!C42","v":0}]
["TOTAL PREDEVELOPMENT COSTS",null,null,null,null,"Total Residential Units:",null,{"$f":"RENTAL_INCOME!D32","v":0}]
["SOURCES"]
["Type of Sources",null,"Interest Rate","Term","Total Predevelopment Sources","% of Total  Cost","Cost per sq ft","Cost per unit"]
["Other Predevelopment Source 1",null,null,null,null,{"$f":"IF($E$124=0,0,E6/$E$124)","v":0},{"$f":"IF($H$2=0,0,E6/$H$2)","v":0},{"$f":"IF($H$3=0,0,E6/$H$3)","v":0}]
["Other Predevelopment Source 2",null,null,null,null,0,0,0]
["Other Predevelopment Source 3",null,null,null,null,0,0,0]
["Other Predevelopment Source 4",null,null,null,null,0,0,0]
["Other Predevelopment Source 5",null,null,null,null,0,0,0]
["Total Predevelopment Sources",null,null,null,{"$f":"SUM(E6:E10)","v":0},0,0,{"$f":"IF($H$3=0,0,E11/$H$3)","v":0}]
["ACQUISITION"]
["Type of Uses",null,null,null,"Total Predevelopment Uses","% of Total  Cost","Cost per sq ft","Cost per unit"]
["Acquisition",null,null,null,null,{"$f":"IF($E$124=0,0,E14/$E$124)","v":0},{"$f":"IF($H$2=0,0,E14/$H$2)","v":0},{"$f":"IF($H$3=0,0,E14/$H$3)","v":0}]
["Land Costs",null,null,null,null,0,{"$f":"IF($H$2=0,0,E15/$H$2)","v":0},0]
["Other Acquisition Costs 1",null,null,null,null,0,0,0]
["Other Acquisition Costs 2",null,null,null,null,0,0,0]
["Other Acquisition Costs 3",null,null,null,null,0,0,0]
["Other Acquisition Costs 4",null,null,null,null,0,0,0]
["Other Acquisition Costs 5",null,null,null,null,0,0,0]
{"$rows_left_out":105}
{"sheet":"RENTAL_DEVELOPMENT_BUDGET","index":5,"n_rows":141,"n_cols":24,"rows_kept":141,"cut":false,"hidden":false,"merged":[[6,19,7,19],[6,20,7,20],[4,0,7,2],[4,3,7,3],[128,4,128,5],[4,4,7,4],[4,5,7,5],[48,0,50,2],[48,3,50,3],[48,4,50,4],[48,5,50,5],[96,0,98,2],[96,3,98,3],[96,4,98,4],[96,5,98,5],[140,4,140,5],[139,4,139,5],[126,9,126,23],[127,9,127,12],[128,9,134,12],[135,9,135,12],[135,17,135,23],[136,9,139,23],[131,4,131,5],[132,4,132,5],[133,4,133,5],[134,4,134,5],[137,4,137,5],[129,4,129,5],[130,4,130,5],[133,2,133,3],[138,2,138,3],[138,4,138,5],[128,13,134,23],[127,13,127,23],[6,21,7,21],[6,22,7,22],[6,23,7,23],[96,6,98,6],[96,7,98,7],[97,18,98,18],[48,6,50,6],[48,7,50,7],[49,18,50,18],[4,7,6,7],[4,6,7,6],[5,8,5,13],[5,14,5,17],[4,19,4,20],[4,8,4,13],[4,18,6,18]]}
["Incurred","Contract","Quote","Dev. Estimate",null,"CBE Committed"]
["DHCD- DEVELOPMENT BUDGET"]
["TOTAL DEVELOPMENT COSTS",null,null,null,null,null,null,null,null,"Total Residential Units",null,null,{"$f":"RENTAL_INCOME!D32","v":0},null,null,null,null,null,null,"Total Gross Square Footage",{"$f":"RENTAL_INCOME!C42","v":0}]
["Acquisition"]
["Type of Uses",null,null,"Total Budgeted Cost","% of  Cost","Cost per sq ft","Cost per unit","Residential Percentage","RESIDENTIAL",null,null,null,null,null,null,null,null,null,"Non-Residential Percentage","NON-RESIDENTIAL"]
[null,null,null,null,null,null,null,null,"Sources for DHCD Eligible Units/Uses",null,null,null,null,null,"Souces for DHCD Ineligible Units/Uses",null,null,null,null,"Source:","Source:","Source:","Source:","Source:"]
[null,null,null,null,null,null,null,null,"Source:","Source:","Source:","Source:","Source:","Source:","Source:","Source:","Source:","Source:"]
[null,null,null,null,null,null,null,null,null,null,null,null,null,null,null,null,null,null,{"$f":"1-H8","v":1}]
["Acquisition",null,null,null,{"$f":"IF($D$16=0,0,D9/$D$16)","v":0},{"$f":"IF($U$3=\"\",0,D9/$U$3)","v":0},{"$f":"IF($M$3=\"\",0,D9/$M$3)","v":0},{"$f":"$H$8*D9","v":0},null,null,null,null,null,null,null,null,null,null,{"$f":"D9-H9","v":0}]
["Land Costs",null,null,null,{"$f":"IF($D$16=0,0,D10/$D$16)","v":0},0,{"$f":"IF($M$3=\"\",0,D10/$M$3)","v":0},{"$f":"$H$8*D10","v":0},null,null,null,null,null,null,null,null,null,null,{"$f":"D10-H10","v":0}]
["Other Acquisition Costs 1",null,null,null,0,0,0,0,null,null,null,null,null,null,null,null,null,null,0]
["Other Acquisition Costs 2",null,null,null,0,0,0,0,null,null,null,null,null,null,null,null,null,null,0]
["Other Acquisition Costs 3",null,null,null,0,0,0,0,null,null,null,null,null,null,null,null,null,null,0]
["Other Acquisition Costs 4",null,null,null,0,0,0,0,null,null,null,null,null,null,null,null,null,null,0]
["Other Acquisition Costs 5",null,null,null,0,0,0,0,null,null,null,null,null,null,null,null,null,null,0]
["Total Acquisition Costs",null,null,{"$f":"SUM(D9:D15)","v":0},{"$f":"IF($D$125=0,0,D16/$D$125)","v":0},{"$f":"SUM(F9:F15)","v":0},0,0,0,{"$f":"SUM(J9:J15)","v":0},0,0,0,0,0,0,0,0,0,0,{"$f":"SUM(U9:U15)","v":0},0,0,0]
["Construction Costs"]
["Construction Costs",null,null,null,{"$f":"IF($D$31=0,0,D18/$D$31)","v":0},{"$f":"IF($U$3=\"\",0,D18/$U$3)","v":0},{"$f":"IF($M$3=\"\",0,D18/$M$3)","v":0},{"$f":"$H$8*D18","v":0},null,null,null,null,null,null,null,null,null,null,{"$f":"D18-H18","v":0}]
["Site work (Incl. Public Work)",null,null,null,{"$f":"IF($D$31=0,0,D19/$D$31)","v":0},0,{"$f":"IF($M$3=\"\",0,D19/$M$3)","v":0},{"$f":"$H$8*D19","v":0},null,null,null,null,null,null,null,null,null,null,{"$f":"D19-H19","v":0}]
["Environmental Remediation",null,null,null,0,0,0,0,null,null,null,null,null,null,null,null,null,null,0]
{"$rows_left_out":122}
{"sheet":"RENTAL_SOURCES","index":6,"n_rows":47,"n_cols":11,"rows_kept":47,"cut":false,"hidden":false,"merged":[[1,0,1,10],[2,0,2,10],[4,0,4,1],[9,2,9,3],[4,2,4,3],[7,2,7,3],[5,2,5,3],[6,2,6,3],[8,2,8,3],[23,6,23,7],[44,2,44,3],[45,2,45,3],[13,0,13,1],[13,2,13,3],[14,2,14,3],[40,0,40,1],[40,2,40,3],[41,2,41,3],[42,2,42,3],[43,2,43,3],[15,2,15,3],[25,0,25,2],[19,0,19,2],[20,0,20,2],[21,0,21,2],[22,0,22,2],[34,7,34,8],[32,7,32,8],[31,7,31,8],[13,6,13,7],[14,8,14,9],[15,8,15,9],[14,6,14,7],[15,6,15,7],[13,8,13,9],[19,6,19,7],[20,6,20,7],[21,6,21,7],[22,6,22,7],[24,6,24,7],[25,6,25,7]]}
[null,"Yes","No","Must pay","Cashflow","Deferred","Construction","Permanent"]
["SOURCES OF FUNDS"]
[]
["PERMANENT DEBT (NON-DHCD, DHCD LOAN AMOUNT CALCULATED BELOW)"]
["Type of Funds",null,"Source of Funds/Lender",null,"Payment Type ","Debt Coverage ","Annual Payment","Interest Rate","Amortization Period","Loan Term","Loan Amount"]
["1st Mortgage"]
["Other Permanent Debt 1"]
["Other Permanent Debt 2"]
["Other Permanent Debt 3"]
["Other Permanent Debt 4"]
["Total Permanent Debt Financing",null,null,null,null,null,{"$f":"+SUM(G6:G10)","v":0},null,null,null,{"$f":"SUM(IF(ISBLANK(K6),0,K6)+IF(ISBLANK(K7),0,K7)+IF(ISBLANK(K8),0,K8)+IF(ISBLANK(K9),0,K9)+IF(ISBLANK(K10),0,K10))","v":0}]
[]
["GRANTS"]
["Type of Funds",null,"Source of Funds",null,"Recoverable?","Provided At:","Grant Term (if recoverable)",null,null,null,"Grant Amount"]
["Other"]
["Other"]
["Total Grant Funding",null,null,null,null,null,null,null,null,null,{"$f":"SUM(K15:K16)","v":0}]
[]
["EQUITY"]
["Type of Equity",null,null,"Source of Equity",null,null,"Equity Pricing",null,null,null,"Amount"]
{"$rows_left_out":28}
{"sheet":"RENTAL_PRO_FORMA","index":7,"n_rows":45,"n_cols":23,"rows_kept":45,"cut":false,"hidden":false,"merged":[]}
[null,null,null,null,"First full year of operations",null,null,null,null,null,null,null,null,null,null,"First full year of operations",{"$f":"F1","v":0}]
[null,null,null,null,"Annual Income Trending",0.02,null,null,null,null,null,null,null,null,null,"Annual Income Trending",{"$f":"F2","v":0.02}]
[null,null,null,null,"Annual Expense Trending",0.03,null,null,null,null,null,null,null,null,null,"Annual Expense Trending",{"$f":"F3","v":0.03}]
[null,null,null,null,"Years Until Sustaining Occupancy",null,null,null,null,null,null,null,null,null,null,"Years Until Sustaining Occupancy",{"$f":"F4","v":0}]
["20-YR OP. PRO FORMA"]
["Income",null,"Year 0","Year 1","Year 2","Year 3","Year 4","Year 5","Year 6","Year 7","Year 8","Year 9","Year 10","Year 11","Year 12","Year 13","Year 14","Year 15","Year 16","Year 17","Year 18","Year 19","Year 20"]
["Low Income Units",null,{"$f":"RENTAL_INCOME!K32-C8","v":0},{"$f":"C7*($F$2+1)^($F$4+1)","v":0},{"$f":"D7*($F$2+1)","v":0},{"$f":"E7*($F$2+1)","v":0},0,0,0,0,0,0,0,0,0,0,0,0,0,0,0,0,0]
["Market Rate Units",null,{"$f":"SUMIF(RENTAL_INCOME!C7:C31,\"Market\",RENTAL_INCOME!K7:K31)","v":0},{"$f":"C8*(F2+1)^(F4+1)","v":0},{"$f":"D8*($F$2+1)","v":0},{"$f":"E8*($F$2+1)","v":0},0,0,0,0,0,0,0,0,0,0,0,0,0,0,0,0,0]
["Nonresidential",null,{"$f":"RENTAL_INCOME!K52","v":0},{"$f":"C9*(F2+1)^(F4+1)","v":0},{"$f":"D9*($F$2+1)","v":0},{"$f":"E9*($F$2+1)","v":0},0,0,0,0,0,0,0,0,0,0,0,0,0,0,0,0,0]
["Gross Project Income",null,{"$f":"SUM(C7:C9)","v":0},{"$f":"SUM(D7:D9)","v":0},{"$f":"SUM(E7:E9)","v":0},0,0,0,0,0,0,0,0,0,0,0,0,0,0,0,0,0,0]
["Vacancy Allowance",null,{"$f":"-(C7*RENTAL_INCOME!$F$33+C8*RENTAL_INCOME!$F$33+C9*RENTAL_INCOME!$F$53)","v":0},{"$f":"-(D7*RENTAL_INCOME!$F$33+D8*RENTAL_INCOME!$F$33+D9*RENTAL_INCOME!$F$53)","v":0},{"$f":"-(E7*RENTAL_INCOME!$F$33+E8*RENTAL_INCOME!$F$33+E9*RENTAL_INCOME!$F$53)","v":0},{"$f":"-(F7*RENTAL_INCOME!$F$33+F8*RENTAL_INCOME!$F$33+F9*RENTAL_INCOME!$F$53)","v":0},{"$f":"-(G7*RENTAL_INCOME!$F$33+G8*RENTAL_INCOME!$F$33+G9*RENTAL_INCOME!$F$53)","v":0},{"$f":"-(H7*RENTAL_INCOME!$F$33+H8*RENTAL_INCOME!$F$33+H9*RENTAL_INCOME!$F$53)","v":0},{"$f":"-(I7*RENTAL_INCOME!$F$33+I8*RENTAL_INCOME!$F$33+I9*RENTAL_INCOME!$F$53)","v":0},{"$f":"-(J7*RENTAL_INCOME!$F$33+J8*RENTAL_INCOME!$F$33+J9*RENTAL_INCOME!$F$53)","v":0},{"$f":"-(K7*RENTAL_INCOME!$F$33+K8*RENTAL_INCOME!$F$33+K9*RENTAL_INCOME!$F$53)","v":0},{"$f":"-(L7*RENTAL_INCOME!$F$33+L8*RENTAL_INCOME!$F$33+L9*RENTAL_INCOME!$F$53)","v":0},{"$f":"-(M7*RENTAL_INCOME!$F$33+M8*RENTAL_INCOME!$F$33+M9*RENTAL_INCOME!$F$53)","v":0},{"$f":"-(N7*RENTAL_INCOME!$F$33+N8*RENTAL_INCOME!$F$33+N9*RENTAL_INCOME!$F$53)","v":0},{"$f":"-(O7*RENTAL_INCOME!$F$33+O8*RENTAL_INCOME!$F$33+O9*RENTAL_INCOME!$F$53)","v":0},{"$f":"-(P7*RENTAL_INCOME!$F$33+P8*RENTAL_INCOME!$F$33+P9*RENTAL_INCOME!$F$53)","v":0},{"$f":"-(Q7*RENTAL_INCOME!$F$33+Q8*RENTAL_INCOME!$F$33+Q9*RENTAL_INCOME!$F$53)","v":0},{"$f":"-(R7*RENTAL_INCOME!$F$33+R8*RENTAL_INCOME!$F$33+R9*RENTAL_INCOME!$F$53)","v":0},{"$f":"-(S7*RENTAL_INCOME!$F$33+S8*RENTAL_INCOME!$F$33+S9*RENTAL_INCOME!$F$53)","v":0},{"$f":"-(T7*RENTAL_INCOME!$F$33+T8*RENTAL_INCOME!$F$33+T9*RENTAL_INCOME!$F$53)","v":0},{"$f":"-(U7*RENTAL_INCOME!$F$33+U8*RENTAL_INCOME!$F$33+U9*RENTAL_INCOME!$F$53)","v":0},{"$f":"-(V7*RENTAL_INCOME!$F$33+V8*RENTAL_INCOME!$F$33+V9*RENTAL_INCOME!$F$53)","v":0},{"$f":"-(W7*RENTAL_INCOME!$F$33+W8*RENTAL_INCOME!$F$33+W9*RENTAL_INCOME!$F$53)","v":0}]
["Effective Gross Income",null,{"$f":"C10+C11","v":0},{"$f":"D10+D11","v":0},{"$f":"E10+E11","v":0},0,0,0,0,0,0,0,0,0,0,0,0,0,0,0,0,0,0]
[]
["Expenses"]
["Administrative",null,{"$f":"RENTAL_EXPENSES!D24-RENTAL_EXPENSES!D10","v":0},{"$f":"(RENTAL_EXPENSES!D24-RENTAL_EXPENSES!D10)*($F$3+1)^($F$4+1)","v":0},{"$f":"D15*($F$3+1)","v":0},{"$f":"E15*($F$3+1)","v":0},0,0,0,0,0,0,0,0,0,0,0,0,0,0,0,0,0]
["Management Fee",null,{"$f":"C12*RENTAL_EXPENSES!$B$10","v":0},{"$f":"D12*RENTAL_EXPENSES!$B$10","v":0},{"$f":"E12*RENTAL_EXPENSES!$B$10","v":0},{"$f":"F12*RENTAL_EXPENSES!$B$10","v":0},{"$f":"G12*RENTAL_EXPENSES!$B$10","v":0},{"$f":"H12*RENTAL_EXPENSES!$B$10","v":0},{"$f":"I12*RENTAL_EXPENSES!$B$10","v":0},{"$f":"J12*RENTAL_EXPENSES!$B$10","v":0},{"$f":"K12*RENTAL_EXPENSES!$B$10","v":0},{"$f":"L12*RENTAL_EXPENSES!$B$10","v":0},{"$f":"M12*RENTAL_EXPENSES!$B$10","v":0},{"$f":"N12*RENTAL_EXPENSES!$B$10","v":0},{"$f":"O12*RENTAL_EXPENSES!$B$10","v":0},{"$f":"P12*RENTAL_EXPENSES!$B$10","v":0},{"$f":"Q12*RENTAL_EXPENSES!$B$10","v":0},{"$f":"R12*RENTAL_EXPENSES!$B$10","v":0},{"$f":"S12*RENTAL_EXPENSES!$B$10","v":0},{"$f":"T12*RENTAL_EXPENSES!$B$10","v":0},{"$f":"U12*RENTAL_EXPENSES!$B$10","v":0},{"$f":"V12*RENTAL_EXPENSES!$B$10","v":0},{"$f":"W12*RENTAL_EXPENSES!$B$10","v":0}]
["Utilities",null,{"$f":"RENTAL_EXPENSES!D35","v":0},{"$f":"RENTAL_EXPENSES!D35*($F$3+1)^($F$4+1)","v":0},{"$f":"D17*($F$3+1)","v":0},{"$f":"E17*($F$3+1)","v":0},0,0,0,0,0,0,0,0,0,0,0,0,0,0,0,0,0]
["Maintenance",null,{"$f":"RENTAL_EXPENSES!D62","v":0},{"$f":"RENTAL_EXPENSES!D62*($F$3+1)^($F$4+1)","v":0},{"$f":"D18*($F$3+1)","v":0},{"$f":"E18*($F$3+1)","v":0},0,0,0,0,0,0,0,0,0,0,0,{"$f":"Q18*($F$3+1)","v":0},0,0,0,0,0]
["Taxes and Insurance",null,{"$f":"RENTAL_EXPENSES!D77","v":0},{"$f":"RENTAL_EXPENSES!D77*($F$3+1)^($F$4+1)","v":0},{"$f":"D19*($F$3+1)","v":0},{"$f":"E19*($F$3+1)","v":0},{"$f":"F19*($F$3+1)","v":0},0,0,0,0,0,0,0,0,0,0,{"$f":"Q19*($F$3+1)","v":0},{"$f":"R19*($F$3+1)","v":0},0,0,0,0]
["Reserves (includes operating)",null,{"$f":"RENTAL_EXPENSES!D79+RENTAL_EXPENSES!D80","v":0},{"$f":"(RENTAL_EXPENSES!D79+RENTAL_EXPENSES!D80)*($F$3+1)^($F$4+1)","v":0},{"$f":"D20*($F$3+1)","v":0},{"$f":"E20*($F$3+1)","v":0},{"$f":"F20*($F$3+1)","v":0},0,0,0,0,0,0,0,0,0,0,{"$f":"Q20*($F$3+1)","v":0},0,0,0,0,0]
{"$rows_left_out":26}
{"sheet":"LIHTC_ELIGIBLE_BASIS","index":8,"n_rows":126,"n_cols":6,"rows_kept":126,"cut":false,"hidden":true,"merged":[[125,0,125,2],[1,0,1,5],[7,0,7,1]]}
[null,null,"Yes"]
["LOW-INCOME HOUSING TAX CREDIT BUDGET"]
[]
[]
["CALCULATION OF ELIGIBLE BASIS"]
[]
["ACQUISITION"]
["Type of Uses",null,"Residential Total","Acquisition","New Construction/ Rehab","Total Eligible Basis"]
["Acquisition",null,{"$f":"RENTAL_DEVELOPMENT_BUDGET!H9","v":0},null,null,{"$f":"SUM(D9:E9)","v":0}]
["Land Costs",null,{"$f":"RENTAL_DEVELOPMENT_BUDGET!H10","v":0},null,null,{"$f":"SUM(D10:E10)","v":0}]
[{"$f":"RENTAL_DEVELOPMENT_BUDGET!A11","v":"Other Acquisition Costs 1"},null,{"$f":"RENTAL_DEVELOPMENT_BUDGET!H11","v":0},null,null,0]
[{"$f":"RENTAL_DEVELOPMENT_BUDGET!A12","v":"Other Acquisition Costs 2"},null,{"$f":"RENTAL_DEVELOPMENT_BUDGET!H12","v":0},null,null,0]
[{"$f":"RENTAL_DEVELOPMENT_BUDGET!A13","v":"Other Acquisition Costs 3"},null,{"$f":"RENTAL_DEVELOPMENT_BUDGET!H13","v":0},null,null,0]
[{"$f":"RENTAL_DEVELOPMENT_BUDGET!A14","v":"Other Acquisition Costs 4"},null,{"$f":"RENTAL_DEVELOPMENT_BUDGET!H14","v":0},null,null,0]
[{"$f":"RENTAL_DEVELOPMENT_BUDGET!A15","v":"Other Acquisition Costs 5"},null,{"$f":"RENTAL_DEVELOPMENT_BUDGET!H15","v":0},null,null,0]
["Total Acquisition Costs",null,{"$f":"RENTAL_DEVELOPMENT_BUDGET!H16","v":0},{"$f":"SUM(D9:D15)","v":0},{"$f":"SUM(E9:E15)","v":0},0]
[]
["CONSTRUCTION"]
["Construction",null,{"$f":"RENTAL_DEVELOPMENT_BUDGET!H18","v":0},null,null,{"$f":"SUM(D19:E19)","v":0}]
["Site Work (incl. Public Work)",null,{"$f":"RENTAL_DEVELOPMENT_BUDGET!H19","v":0},null,null,0]
{"$rows_left_out":107}
{"sheet":"LIHTC_EQUITY","index":9,"n_rows":51,"n_cols":10,"rows_kept":51,"cut":false,"hidden":true,"merged":[[1,0,1,8],[33,2,33,5],[3,0,3,7],[4,0,4,7],[5,0,5,7]]}
[null,null,"Yes","No"]
["LOW-INCOME HOUSING TAX CREDIT EQUITY",null,null,null,null,null,null,null,null,1]
[null,null,null,null,null,null,null,null,null,2]
["How many buildings are in the project?",null,null,null,null,null,null,null,1,3]
["Are any buildings in the project in a difficult to develop area, a qualfied census tract, or been granted a basis bost by DHCD?",null,null,null,null,null,null,null,"Yes",4]
["If Yes, how many buildings will be in a difficult to develop area, a qualfied census tract, or been granted a basis bost by DHCD?",null,null,null,null,null,null,null,1,5]
[null,null,null,null,null,null,null,null,null,6]
["CALCULATION OF TAX CREDIT AMOUNT",null,null,null,null,null,null,null,null,7]
["Maximum Low-Income Housing Tax Credit Based on Eligible Costs",null,null,null,null,null,null,null,null,8]
["Description",null,null,null,null,null,null,"Acquisition","New Construction/ Rehab",9]
["Eligible Basis (from LIHTC Eligible Basis tab)",null,null,null,null,null,null,{"$f":"LIHTC_ELIGIBLE_BASIS!D126","v":0},{"$f":"LIHTC_ELIGIBLE_BASIS!E126","v":0},10]
["Less Federal Grants and/or below-market Federal Loans",null,null,null,null,null,null,null,null,11]
["Less non-qualified, non-recourse financing",null,null,null,null,null,null,null,null,12]
["Less costs of non-qualifying Units of higher quality or excess costs of non-qualiftying units",null,null,null,null,null,null,null,null,13]
["Less Historic Rehabilitation Tax Credit (Residential portion only)",null,null,null,null,null,null,null,null,14]
["Adjusted Eligible Basis",null,null,null,null,null,null,{"$f":"H11-SUM(H12:H15)","v":0},{"$f":"I11-SUM(I12:I15)","v":0},15]
["Difficult to Developer Area, QCT, or DHCD approved Basis Boost",null,null,null,null,null,null,1,{"$f":"IF($I$5=\"yes\",(I6*130%+((I4-I6)*100%))/I4,100%)","v":1.3},16]
["Applicable Fraction (calculate below)",null,null,null,null,null,null,{"$f":"IF(D45=\"\",IF(H45=\"\",\"\",H45),IF(H45=\"\",D45,MIN(D45,H45)))","v":""},{"$f":"IF(D45=\"\",IF(H45=\"\",\"\",H45),IF(H45=\"\",D45,MIN(D45,H45)))","v":""},17]
["Qualified Basis",null,null,null,null,null,null,{"$f":"H16*H18*H17","v":0},{"$f":"I16*I18*I17","v":0},18]
["Applicable Percentage (construction basis qualified for 4% or 9%?)",null,null,null,null,null,null,3.2199999999999999E-2,0.09,19]
{"$rows_left_out":32}
{"sheet":"DHCD_UNDERWRITING_STANDARDS","index":10,"n_rows":73,"n_cols":9,"rows_kept":73,"cut":false,"hidden":true,"merged":[]}
["DHCD PROJECT STANDARDS",null,null,null,null,"Select Building Type:","New Construction Rental","Substantial Rehabilitation","Moderate Rehabilitation"]
[null,null,null,null,null,"Townhouses",180,145,100]
["Project Manager:",null,null,"Date:",null,"Garden Apt/Condo",175,135,95]
[{"$f":"\"Project Name:\"&\"\"&SIGNATURE!H19","v":"Project Name:"},null,null,"Funding Round:",null,"Elevator Buildings (≤ 5 Floors)",210,150,125]
[null,null,null,null,null,"Elevator Buildings (6 or more floors)",240,165,140]
["Terms/Underwriting Standards","Standard","Actual","Meets Standard?","Explanation/Waiver Requested"]
["Background"]
["Application Scorecard reviewed","Yes"]
["All Project Commitments made in application are met","Yes",null,null,null,"Yes"]
["Reviewer Comments reviewed and addressed","Yes",null,null,null,"No"]
["Site Visit held","Yes",null,null,null,"N/A"]
["Other Agencies Involved (list)"]
["Changes from initial application (list, if any)"]
[1]
[2]
[3]
[4]
[5]
["Loan Requirements/Terms"]
["HPTF funding request equal to or less than:",0.49,{"$f":"RENTAL_SOURCES!E38/DHCD_UNDERWRITING_BUDGET!C140","v":{"$error":"#DIV/0!"}}]
{"$rows_left_out":54}
{"sheet":"DHCD_UNDERWRITING_BUDGET","index":11,"n_rows":140,"n_cols":7,"rows_kept":140,"cut":false,"hidden":true,"merged":[[1,0,1,6],[4,1,4,2],[4,4,4,6]]}
[null,null,"Yes"]
["DHCD UNDERWRITING BUDGET WITH SOURCES AND USES"]
[null,null,null,null,null,"DATE:"]
[]
["PROJECT NAME:",{"$f":"SIGNATURE!H19","v":0},null,"DEVELOPER NAME:",{"$f":"SIGNATURE!H16","v":0}]
[]
["SOURCES",null,"Total Sources and Uses","DFD Underwriting ","Requested Changes","DFD Per Unit","DFD Per Sq. Foot"]
["Permanent Source 1 - ",{"$f":"RENTAL_SOURCES!C6","v":0},{"$f":"RENTAL_SOURCES!K6","v":0},null,{"$f":"C8-D8","v":0},{"$f":"D8/RENTAL_INCOME!$D$32","v":{"$error":"#DIV/0!"}},{"$f":"D8/RENTAL_INCOME!$C$42","v":{"$error":"#DIV/0!"}}]
["Permanent Source 2 - ",{"$f":"RENTAL_SOURCES!C7","v":0},{"$f":"RENTAL_SOURCES!K7","v":0},null,{"$f":"C9-D9","v":0},{"$f":"D9/RENTAL_INCOME!$D$32","v":{"$error":"#DIV/0!"}},{"$f":"D9/RENTAL_INCOME!$C$42","v":{"$error":"#DIV/0!"}}]
["Permanent Source 3 - ",{"$f":"RENTAL_SOURCES!C8","v":0},{"$f":"RENTAL_SOURCES!K8","v":0},null,0,{"$f":"D10/RENTAL_INCOME!$D$32","v":{"$error":"#DIV/0!"}},{"$f":"D10/RENTAL_INCOME!$C$42","v":{"$error":"#DIV/0!"}}]
["Permanent Source 4 - ",{"$f":"RENTAL_SOURCES!C9","v":0},{"$f":"RENTAL_SOURCES!K9","v":0},null,0,{"$f":"D11/RENTAL_INCOME!$D$32","v":{"$error":"#DIV/0!"}},{"$f":"D11/RENTAL_INCOME!$C$42","v":{"$error":"#DIV/0!"}}]
["Permanent Source 5 - ",{"$f":"RENTAL_SOURCES!C10","v":0},{"$f":"RENTAL_SOURCES!K10","v":0},null,0,{"$f":"D12/RENTAL_INCOME!$D$32","v":{"$error":"#DIV/0!"}},{"$f":"D12/RENTAL_INCOME!$C$42","v":{"$error":"#DIV/0!"}}]
["Grant Source 1 -",{"$f":"RENTAL_SOURCES!C15","v":0},{"$f":"RENTAL_SOURCES!K15","v":0},null,0,{"$f":"D13/RENTAL_INCOME!$D$32","v":{"$error":"#DIV/0!"}},{"$f":"D13/RENTAL_INCOME!$C$42","v":{"$error":"#DIV/0!"}}]
["Grant Source 2 -",{"$f":"RENTAL_SOURCES!C16","v":0},{"$f":"RENTAL_DEVELOPMENT_BUDGET!H3","v":0},null,0,{"$f":"D14/RENTAL_INCOME!$D$32","v":{"$error":"#DIV/0!"}},{"$f":"D14/RENTAL_INCOME!$C$42","v":{"$error":"#DIV/0!"}}]
["LIHTC Equity -",{"$f":"RENTAL_SOURCES!D21","v":0},{"$f":"RENTAL_SOURCES!K21","v":0},null,{"$f":"C15-D15","v":0},{"$f":"D15/RENTAL_INCOME!$D$32","v":{"$error":"#DIV/0!"}},{"$f":"D15/RENTAL_INCOME!$C$42","v":{"$error":"#DIV/0!"}}]
["Other Tax Credit Equity -",{"$f":"RENTAL_SOURCES!D22","v":0},{"$f":"RENTAL_SOURCES!K22","v":0},null,0,{"$f":"D16/RENTAL_INCOME!$D$32","v":{"$error":"#DIV/0!"}},{"$f":"D16/RENTAL_INCOME!$C$42","v":{"$error":"#DIV/0!"}}]
["Deferred Developer Fee",null,{"$f":"RENTAL_SOURCES!K23","v":0},null,0,{"$f":"D17/RENTAL_INCOME!$D$32","v":{"$error":"#DIV/0!"}},{"$f":"D17/RENTAL_INCOME!$C$42","v":{"$error":"#DIV/0!"}}]
["Other Developer Equity",{"$f":"RENTAL_SOURCES!D25","v":"Other Developer Equity"},{"$f":"RENTAL_SOURCES!K25","v":0},null,0,{"$f":"D18/RENTAL_INCOME!$D$32","v":{"$error":"#DIV/0!"}},{"$f":"D18/RENTAL_INCOME!$C$42","v":{"$error":"#DIV/0!"}}]
["Interim Income",{"$f":"RENTAL_SOURCES!D26","v":0},{"$f":"RENTAL_SOURCES!K26","v":0},null,0,{"$f":"D19/RENTAL_INCOME!$D$32","v":{"$error":"#DIV/0!"}},{"$f":"D19/RENTAL_INCOME!$C$42","v":{"$error":"#DIV/0!"}}]
["DHCD Financing - ","PROVIDE PROGRAM HERE",{"$f":"RENTAL_SOURCES!E38","v":0},null,0,{"$f":"D20/RENTAL_INCOME!$D$32","v":{"$error":"#DIV/0!"}},{"$f":"D20/RENTAL_INCOME!$C$42","v":{"$error":"#DIV/0!"}}]
{"$rows_left_out":120}