{"text_format":"1","workbook":"xlsx","n_sheets":10,"sheets":["Overview","1","2","BMP Design","Financial Input","Financial Summary","Detailed Estimation","Background","References","Costs"],"not_rendered":{"charts":1,"images":4,"macros":1,"external_links":0,"defined_names":109,"comments":4,"pivot_tables":0},"unopened":[],"bounds":{"document_bytes":16777216,"sheet_cells":100000,"rows_first":2000,"rows_last":500,"rows_between":2000,"halvings":0,"cell_chars":16384,"cell_head_chars":4096},"cells_cut":0,"cells_raw":0,"read":"whole","date_system":"1900"}

{"sheet":"Overview","index":0,"n_rows":36,"n_cols":12,"rows_kept":36,"cut":false,"hidden":false,"merged":[[22,4,22,7],[13,4,13,6],[2,2,2,7],[4,2,9,8],[10,2,10,8],[19,2,20,7],[16,3,16,6],[31,1,31,3],[29,2,29,7],[24,2,24,7],[27,2,27,7],[28,2,28,7]]}
[]
[]
[null,null,"Stormwater Retention Credit\n(SRC) Price Lock Program\nFinancial Return Calculator\nRegulatory Review Division"]
[]
[null,null,"This calculator estimates the potential SRC eligibility and return on investment for a runoff-reducing green infrastructure project participating in DOEE's SRC Price Lock Program.  To begin your estimate, please complete the fields below.  If  complete site, construction, and financial information is not available, the tool will use assumptions to provide a rough estimate.  This calculator will not continue to subsequent pages if required information is missing or if information provided is inconsistent.\n\nThis calculator is a planning and estimation tool only.  DOEE does not guarantee financial return, SRC eligibility, or other results.  The use of this tool does not submit information to DOEE.\n\nBy enabling macros and using the \"Clear All Fields\" button you can remove your previous inputs and return to a blank template."]
[]
[]
[]
{"$rows_left_out":29}
{"sheet":"1","index":1,"n_rows":93,"n_cols":29,"rows_kept":93,"cut":false,"hidden":false,"merged":[[17,12,19,12],[17,13,19,13],[17,14,19,14],[20,21,20,22],[21,21,21,22],[22,21,22,22],[23,12,23,13],[23,14,23,15],[23,16,23,17],[23,18,23,19],[23,20,23,21],[17,23,19,23],[15,2,16,23],[17,2,18,3],[17,4,18,5],[19,4,19,5],[19,2,19,3],[19,9,19,10],[17,11,19,11],[17,16,19,16],[17,19,19,19],[17,17,19,17],[17,20,19,20],[17,21,19,22],[17,15,19,15],[17,18,19,18],[18,6,18,10],[9,4,10,7],[2,2,2,7],[6,2,6,3],[5,2,5,5],[5,6,5,8],[7,2,7,3],[8,2,8,3],[4,2,4,3],[4,5,4,8],[23,9,23,10],[20,2,20,3],[21,2,21,3],[22,2,22,3],[17,6,17,10],[20,4,20,5],[21,4,21,5],[22,4,22,5],[21,9,21,10],[22,9,22,10],[20,9,20,10]]}
[]
[]
[null,null,"Enter Land Cover Area by Type\nIf land cover information is unavailable, the calculator will assume 100% impervious pre-project land cover and 90% impervious and 10% BMP post-project land cover."]
[]
[null,null,"Total Project Area (ft2):ii",null,{"$f":"Overview!I28","v":0},{"$f":"IF(OR(Pre>0,Post>0),\" \",\"  For a more detailed estimate, include land cover square footage below.\")","v":"  For a more detailed estimate, include land cover square footage below."}]
[]
[null,null,"Land Cover Type:",null,"Natural","Compacted","Impervious","BMP"]
[null,null,"Post-project  (ft2)",null,null,null,null,null,{"$f":"SUM(E8:H8)","v":0}]
{"$rows_left_out":86}
{"sheet":"2","index":2,"n_rows":33,"n_cols":9,"rows_kept":33,"cut":false,"hidden":true,"merged":[[12,4,13,4],[12,5,13,5],[10,8,10,9],[17,8,17,9],[16,2,16,5],[15,2,15,3],[12,2,12,3],[14,2,14,3],[13,2,13,3],[2,2,2,7],[6,8,6,9],[7,2,7,3],[8,2,8,3],[11,2,11,9],[9,4,9,7],[4,2,4,3],[4,5,4,9],[6,2,6,3],[5,2,5,6],[7,8,7,9],[8,8,8,9]]}
[]
[]
[null,null,"Enter Land Cover Type Area\nIf land cover information is unavailable, the calculator will assume 100% impervious land cover pre-project and 90% impervious and 10% BMP post-project land cover."]
[]
[null,null,"Total Project Area (ft2):ii",null,{"$f":"Overview!I28","v":0},{"$f":"IF(OR(I8>0,I9>0),\" \",\"  For a more detailed estimate, include land cover square footage below.\")","v":"  For a more detailed estimate, include land cover square footage below."}]
[null,null,{"$f":"IF(MS4_MLD=\"MSI\",\"*Please include building footprint in the land cover information.\",\"\")","v":""}]
[null,null,"Land Cover Type:",null,"Natural","Compacted","Impervious","BMP","Total"]
[null,null,"Post-project  (ft2)",null,null,null,null,null,{"$f":"SUM(E8:H8)","v":0}]
{"$rows_left_out":26}
{"sheet":"BMP Design","index":3,"n_rows":26,"n_cols":38,"rows_kept":26,"cut":false,"hidden":false,"merged":[[21,2,21,3],[8,5,8,6],[9,5,9,6],[10,5,10,6],[11,5,11,6],[12,5,12,6],[13,5,13,6],[14,5,14,6],[15,5,15,6],[16,5,16,6],[17,5,17,6],[16,3,16,4],[17,3,17,4],[10,3,10,4],[11,3,11,4],[13,3,13,4],[14,3,14,4],[15,3,15,4],[4,29,5,29],[4,22,5,22],[4,26,5,26],[4,27,5,27],[4,21,5,21],[5,3,5,4],[6,3,6,4],[7,3,7,4],[8,3,8,4],[9,3,9,4],[7,5,7,6],[3,20,5,20],[3,25,5,25],[3,32,5,32],[6,30,6,31],[7,30,7,31],[8,30,8,31],[12,3,12,4],[3,7,3,10],[3,28,5,28],[6,5,6,6],[2,2,2,30],[4,7,4,10],[4,18,5,18],[4,12,5,12],[4,14,5,14],[4,16,5,16],[4,13,5,13],[4,15,5,15],[4,17,5,17],[4,11,5,11],[5,5,5,6],[3,2,4,4],[3,5,4,6],[3,30,5,31],[20,7,20,10],[15,30,15,31],[16,30,16,31],[17,30,17,31],[9,30,9,31],[10,30,10,31],[11,30,11,31],[12,30,12,31],[13,30,13,31],[18,30,18,31],[14,30,14,31]]}
[]
[]
[null,null,"Enter Project BMP Design Information\nIf BMP design information is unavailable, you may leave this page blank to assume BMPs manage the 1.7-inch storm across the Total Project Area.\nTo estimate more accurate retention volume and project costs, enter BMP Type, BMP Subtype, and Contributing Drainage Area.  If unavailable, Storage Volume information may be left blank."]
[null,null,"BMP",null,null,"BMP Subtype",null,"Contributing Drainage Area (CDA) (ft2)",null,null,null,null,null,null,null,null,null,null,null,null,"Storage Volume (ft3)",null,null,null,null,"Receiving Area (ft2)",null,null,"Number of Trees",null,"BMP Retention Vol. Achieved (ft3)",null,"BMP Retention Vol. Achieved (gal)"]
[null,null,null,null,null,null,null,"CDA Required",null,null,null,"COUNTA","Nat ft2\nCalc","If Nat Blank","Comp ft2\nCalc","If Comp Blank","IMP ft2\nCalc","If IMP Blank","BMP ft2\nCalc",null,null,"If Sv Blank","RWH Sv Conv",null,null,null,"Ra Calc","If Ra Blank",null,"Retention Value"]
[null,null,null,"BMP Type and Subtype do not match",null,"BMP Subtype Required",null,"Natural","Compacted","Impervious","BMP",null,null,null,null,null,null,null,null,"If BMP Blank",null,null,null,"1.7 Rv","if blank"]
[null,null,"1.",null,null,null,null,null,null,null,null,{"$f":"IF(SUM(H7:K7)>0,1,\"\")","v":""},{"$f":"IFERROR(IF(ISBLANK(H7),N7,H7),0)","v":0},{"$f":"IFERROR(IF(OR(SUM(H7:K7)>0,COUNTA(F7)=0),0,Background!$E$22-SUM($H$7:$H$18))/(COUNTA('BMP Design'!$F$7:$F$18)-COUNT($L$7:$L$18)),0)","v":0},{"$f":"IFERROR(IF(ISBLANK(I7),P7,I7),0)","v":0},{"$f":"IFERROR(IF(OR(SUM(H7:K7)>0,COUNTA(F7)=0),0,Background!$F$22-SUM($I$7:$I$18))/(COUNTA('BMP Design'!$F$7:$F$18)-COUNT($L$7:$L$18)),0)","v":0},{"$f":"IFERROR(IF(ISBLANK(J7),R7,J7),0)","v":0},{"$f":"IFERROR(IF(OR(SUM(H7:K7)>0,COUNTA(F7)=0),0,Background!$G$22-SUM($J$7:$J$18))/(COUNTA('BMP Design'!$F$7:$F$18)-COUNT($J$7:$J$18)),0)","v":0},{"$f":"IFERROR(IF(ISBLANK(K7),T7,K7),0)","v":0},{"$f":"IFERROR(IF(OR(SUM(H7:K7)>0,COUNTA(F7)=0),0,Background!$H$22-SUM($J$7:$J$18))/(COUNTA('BMP Design'!$E$7:$E$18)-COUNT($K$7:$K$18)),0)","v":0},null,{"$f":"IF(ISBLANK(U7),X7,U7)","v":0},{"$f":"IF(F7=\"Rainwater harvesting\",((References!$E$2*X7)*7.48),\"\")","v":""},{"$f":"IF(D7=\"Tree Planting and Preservation\",\"Tree\",1.7/12*(M7*0.05+O7*0.25+Q7*0.95+S7*0.95))","v":0},{"$f":"IF(ISBLANK(U7),X7,U7)","v":0},null,{"$f":"IF(ISBLANK(Z7),AB7,Z7)","v":0},{"$f":"IF(E7=\"Simple disconnection to amended soils\",(W7/40)*100,IF(E7=\"Simple disconnection to a conservation area\",(W7/60)*100,IF(E7=\"Simple disconnection to a pervious area\",(W7/20)*100,0)))","v":0},null,{"$f":"IFERROR(IF(F7=\"Permeable pavement - Standard\",K7*0.045,(INDIRECT(AI7))),\"\")","v":""},{"$f":"IF(D7=\"Tree Planting and Preservation\",AD7,IF(OR(D7=\"\",F7=\"\",SUM(H7:K7)=0),0,IFERROR(IF(AD7>1,MIN(AD7,Y7),MIN((AD7*Y7),(1.7/12*(M7*References!$B$16+O7*References!$B$17+Q7*References!$B$18+S7*References!$B$18)))),\"0.0\")))","v":0},null,{"$f":"IFERROR(AE7*7.48,0)","v":0},{"$f":"IF(D7=\"\",\"\",IF(D7=\"Green Roof\",\"Green\",IF(D7=\"Rainwater Harvesting\",\"Rainwater\",IF(D7=\"Impervious Surface Disconnection\",\"Impervious\",IF(D7=\"Permeable Pavement\",\"Permeable\",IF(D7=\"Tree Planting and Preservation\",\"Tree\",IF(D7=\"Open Channel\",\"Open\",D7)))))))","v":""},{"$f":"IF(F7=\"\",\"\",IF(F7=\"Extensive green roof\",\"Extensive\",IF(F7=\"Intensive green roof\",\"Intensive\",IF(F7=\"Rainwater harvesting\",\"RWHarvest\",IF(F7=\"Disconnection to a conservation area\",\"Conservation\",IF(F7=\"Disconnection to amended soils\",\"IDAmended\",IF(F7=\"Disconnection to a pervious area\",\"Pervious\",IF(F7=\"Permeable pavement - Enhanced\",\"PPEnhanced\",IF(F7=\"Permeable pavement - Standard\",\"PPStandard\",IF(F7=\"Bioretention - Enhanced\",\"BioEnhanced\",IF(F7=\"Bioretention - Standard\",\"BioStandard\",IF(F7=\"Infiltration trench\",\"Trench\",IF(F7=\"Infiltration basin\",\"Basin\",IF(F7=\"Grass channel\",\"Grass\",IF(F7=\"Grass channel - amended soils\",\"GCAmended\",IF(F7=\"Dry swale\",\"DrySwale\",IF(F7=\"wet swale\",\"WetSwale\",IF(F7=\"Micropool ED pond\",\"Micropool\",IF(F7=\"Wet pond\",\"WetPond\",IF(F7=\"Wet ED pond\",\"EDPond\",IF(F7=\"Shallow wetland\",\"Shallow\",IF(F7=\"ED shallow wetland\",\"EDWet\",IF(F7=\"Tree preservation\",\"Preservation\",IF(F7=\"Tree planting\",\"Planting\"))))))))))))))))))))))))","v":""},{"$f":"VLOOKUP(D7,Match,2,0)","v":{"$error":"#N/A"}},{"$f":"VLOOKUP(F7,Match1,2,0)","v":{"$error":"#N/A"}},{"$f":"IF(AJ7=AK7,\"\",1)","v":{"$error":"#N/A"}}]
[null,null,"2.",null,null,null,null,null,null,null,null,{"$f":"IF(SUM(H8:K8)>0,1,\"\")","v":""},{"$f":"IFERROR(IF(ISBLANK(H8),N8,H8),0)","v":0},{"$f":"IFERROR(IF(OR(SUM(H8:K8)>0,COUNTA(F8)=0),0,Background!$E$22-SUM($H$7:$H$18))/(COUNTA('BMP Design'!$F$7:$F$18)-COUNT($L$7:$L$18)),0)","v":0},{"$f":"IFERROR(IF(ISBLANK(I8),P8,I8),0)","v":0},{"$f":"IFERROR(IF(OR(SUM(H8:K8)>0,COUNTA(F8)=0),0,Background!$F$22-SUM($I$7:$I$18))/(COUNTA('BMP Design'!$F$7:$F$18)-COUNT($L$7:$L$18)),0)","v":0},{"$f":"IFERROR(IF(ISBLANK(J8),R8,J8),0)","v":0},{"$f":"IFERROR(IF(OR(SUM(H8:K8)>0,COUNTA(F8)=0),0,Background!$G$22-SUM($J$7:$J$18))/(COUNTA('BMP Design'!$F$7:$F$18)-COUNT($J$7:$J$18)),0)","v":0},{"$f":"IFERROR(IF(ISBLANK(K8),T8,K8),0)","v":0},{"$f":"IFERROR(IF(OR(SUM(H8:K8)>0,COUNTA(F8)=0),0,Background!$H$22-SUM($J$7:$J$18))/(COUNTA('BMP Design'!$E$7:$E$18)-COUNT($K$7:$K$18)),0)","v":0},null,{"$f":"IF(ISBLANK(U8),W8,U8)","v":""},{"$f":"IF(F8=\"Rainwater harvesting\",((References!$E$2*X8)*7.48),\"\")","v":""},0,{"$f":"IF(ISBLANK(U8),X8,U8)","v":0},null,{"$f":"IF(ISBLANK(Z8),AB8,Z8)","v":0},0,null,{"$f":"IFERROR(IF(F8=\"Permeable pavement - Standard\",K8*0.045,(INDIRECT(AI8))),\"\")","v":""},{"$f":"IF(D8=\"Tree Planting and Preservation\",AD8,IF(OR(D8=\"\",F8=\"\",SUM(H8:K8)=0),0,IFERROR(IF(AD8>1,MIN(AD8,Y8),MIN((AD8*Y8),(1.7/12*(M8*References!$B$16+O8*References!$B$17+Q8*References!$B$18+S8*References!$B$18)))),\"0.0\")))","v":0},null,{"$f":"IFERROR(AE8*7.48,0)","v":0},"","",{"$error":"#N/A"},{"$error":"#N/A"},{"$f":"IF(AJ8=AK8,\"\",1)","v":{"$error":"#N/A"}}]
{"$rows_left_out":19}
{"sheet":"Financial Input","index":4,"n_rows":35,"n_cols":18,"rows_kept":35,"cut":false,"hidden":false,"merged":[[29,2,29,7],[27,2,27,7],[33,2,33,7],[8,16,9,16],[8,13,9,13],[8,12,9,12],[8,11,9,11],[8,14,9,14],[8,15,9,15],[20,2,20,4],[13,2,13,3],[19,2,19,4],[15,2,15,4],[16,2,16,4],[6,11,6,13],[7,11,7,13],[6,14,6,15],[7,14,7,15],[28,2,28,7],[17,2,17,4],[18,2,18,4],[7,2,7,4],[8,2,8,4],[9,2,9,4],[10,2,10,4],[12,2,12,4],[11,2,11,4],[14,3,14,4],[3,11,3,16],[2,11,2,16],[4,11,4,16],[2,2,4,7],[5,5,5,7],[5,11,5,13],[5,14,5,16]]}
[]
[]
[null,null,"Enter SRC Project Costs\nIf financial information is unavailable for a line item, leave the user input blank\nto use an assumed or calculated value.",null,null,null,null,null,null,null,null,"Enter SRC Project Revenue8"]
[null,null,null,null,null,null,null,null,null,null,null,{"$f":"IF(AND(Activity=\"Voluntary\",Price_AWDZ=\"Yes\"),\"For the first 12 years, prices below are set according the current rates in DOEE's  SRC Price Lock Program and inflation adjusted thereafter. Alternativey, the User may input their own sale price.\",\"To claculate a possible Return on Investment, enter a SRC Sale Price for the first year.  Prices will be inflation adjusted thereafter.\")","v":"To claculate a possible Return on Investment, enter a SRC Sale Price for the first year.  Prices will be inflation adjusted thereafter."}]
[null,null,null,null,null,null,null,null,null,null,null,{"$f":"IF(I8<30,\"*BMP Life Cycle beyond the Investment Period is shown in gold.\",\"\")","v":"*BMP Life Cycle beyond the Investment Period is shown in gold."}]
[null,null," Type of Project:",null,null,{"$f":"IF(Background!I5=\"MLD\",\"Major Land Disturbing\",IF(Background!I5=\"MSI\",\"Major Substantial Improvement\",IF(Background!I5=\"Voluntary\",\"Voluntary Retrofit\",\"\")))","v":"Voluntary Retrofit"},null,null,null,null,null,"Years 1-15",null,null,"Years 16-30"]
[null,null,"  Project Cost Data",null,null,"Default Value",null,"User Input","Used in Calcs",null,null,"  Project Revenue Data",null,null,"Default Value",null,"User Input"]
[null,null,"Investment Period - Years 1",null,null,12,null,null,{"$f":"IF(ISBLANK(H8),F8,H8)","v":12},null,null,"Inflation Rate of SRC Prices - Annual",null,null,1.9099999999999999E-2,null,null,{"$f":"IF(ISBLANK(Q8),O8,Q8)","v":1.9099999999999999E-2}]
{"$rows_left_out":28}
{"sheet":"Financial Summary","index":5,"n_rows":33,"n_cols":13,"rows_kept":33,"cut":false,"hidden":false,"merged":[[7,2,7,3],[9,2,9,3],[11,2,11,3],[3,2,5,3],[2,2,2,7],[3,4,4,4]]}
[]
[]
[null,null,"Financial Summary\nThe values below were claculated using User inputs and default or assumed values.\nDOEE does not guarantee financial retrun, SRC eligibilty, or other results."]
[null,null,"Potential SRC Eligibility",null,"Annual",null,"Investment Period",null,"BMP Life Cycle Period"]
[null,null,null,null,null,null,{"$f":"'Financial Input'!I8&\" \"&\"Years\"","v":"12 Years"},null,"30 Years"]
[null,null,null,null,{"$f":"IF(ROUND(('BMP Design'!AG19+IF(Background!I5=\"Voluntary\",Background!H28,-Background!I28))-IF('1'!H9>0,Pre_BMP,0),0)<0,0,ROUND(('BMP Design'!AG19+IF(Background!I5=\"Voluntary\",Background!H28,-Background!I28))-IF('1'!H9>0,Pre_BMP,0),0))","v":0},null,{"$f":"E6*'Financial Input'!I8","v":0},null,{"$f":"E6*30","v":0}]
[]
[null,null," Total Revenue ",null,null,null,{"$f":"'Detailed Estimation'!F17","v":0},null,{"$f":"'Detailed Estimation'!G17","v":0}]
{"$rows_left_out":26}
{"sheet":"Detailed Estimation","index":6,"n_rows":27,"n_cols":37,"rows_kept":27,"cut":false,"hidden":false,"merged":[[26,1,26,7],[1,1,3,6],[5,2,5,4],[6,2,6,4],[7,2,7,4],[9,2,9,4],[8,2,8,4],[12,2,12,4],[11,2,11,4],[18,2,18,4],[19,2,19,4],[10,2,10,5],[17,2,17,5],[13,2,13,4],[14,2,14,4],[15,2,15,4],[16,2,16,4]]}
[]
[null,"Detailed Estimation\nDOEE does not guarantee financial retrun, SRC eligibilty, or other results."]
[]
[null,null,null,null,null,null,null,1,2,3,4,5,6,7,8,9,10,11,12,13,14,15,16,17,18,19,20,21,22,23,24,25,26,27,28,29,30]
[null,null,null,null,null,"Total Over\nInvestment\nPeriod","Total Over\nBMP Life\nCycle","Year 1","Year 2","Year 3","Year 4","Year 5","Year 6","Year 7","Year 8","Year 9","Year 10","Year 11","Year 12","Year 13","Year 14","Year 15","Year 16","Year 17","Year 18","Year 19","Year 20","Year 21","Year 22","Year 23","Year 24","Year 25","Year 26","Year 27","Year 28","Year 29","Year 30"]
[null,null,"Out-of-Pocket Costsii",null,null,{"$f":"G6","v":0},{"$f":"H6","v":0},{"$f":"-'Financial Input'!I16","v":0},{"$f":"\" \"","v":" "},{"$f":"\" \"","v":" "}," "," "," "," "," "," "," "," "," "," "," "," "," "," "," "," "," "," "," "," "," "," "," "," "," "," "," "]
[null,null,"Loan Repaymentii",null,null,{"$f":"SUM(H7:AK7)","v":-2036.1600000000003},{"$f":"SUM(H7:AAK7)","v":-2036.1600000000003},{"$f":"References!L20*-1","v":-339.36},{"$f":"IF('Financial Input'!$I$19>=I4,(References!$L$20*-1),\" \")","v":-339.36},{"$f":"IF('Financial Input'!$I$19>=J4,(References!$L$20*-1),\" \")","v":-339.36},{"$f":"IF('Financial Input'!$I$19>=K4,(References!$L$20*-1),\" \")","v":-339.36},{"$f":"IF('Financial Input'!$I$19>=L4,(References!$L$20*-1),\" \")","v":-339.36},{"$f":"IF('Financial Input'!$I$19>=M4,(References!$L$20*-1),\" \")","v":-339.36},{"$f":"IF('Financial Input'!$I$19>=N4,(References!$L$20*-1),\" \")","v":" "},{"$f":"IF('Financial Input'!$I$19>=O4,(References!$L$20*-1),\" \")","v":" "},{"$f":"IF('Financial Input'!$I$19>=P4,(References!$L$20*-1),\" \")","v":" "},{"$f":"IF('Financial Input'!$I$19>=Q4,(References!$L$20*-1),\" \")","v":" "},{"$f":"IF('Financial Input'!$I$19>=R4,(References!$L$20*-1),\" \")","v":" "},{"$f":"IF('Financial Input'!$I$19>=S4,(References!$L$20*-1),\" \")","v":" "},{"$f":"IF('Financial Input'!$I$19>=T4,(References!$L$20*-1),\" \")","v":" "},{"$f":"IF('Financial Input'!$I$19>=U4,(References!$L$20*-1),\" \")","v":" "},{"$f":"IF('Financial Input'!$I$19>=V4,(References!$L$20*-1),\" \")","v":" "},{"$f":"IF('Financial Input'!$I$19>=W4,(References!$L$20*-1),\" \")","v":" "},{"$f":"IF('Financial Input'!$I$19>=X4,(References!$L$20*-1),\" \")","v":" "},{"$f":"IF('Financial Input'!$I$19>=Y4,(References!$L$20*-1),\" \")","v":" "},{"$f":"IF('Financial Input'!$I$19>=Z4,(References!$L$20*-1),\" \")","v":" "},{"$f":"IF('Financial Input'!$I$19>=AA4,(References!$L$20*-1),\" \")","v":" "},{"$f":"IF('Financial Input'!$I$19>=AB4,(References!$L$20*-1),\" \")","v":" "},{"$f":"IF('Financial Input'!$I$19>=AC4,(References!$L$20*-1),\" \")","v":" "},{"$f":"IF('Financial Input'!$I$19>=AD4,(References!$L$20*-1),\" \")","v":" "},{"$f":"IF('Financial Input'!$I$19>=AE4,(References!$L$20*-1),\" \")","v":" "},{"$f":"IF('Financial Input'!$I$19>=AF4,(References!$L$20*-1),\" \")","v":" "},{"$f":"IF('Financial Input'!$I$19>=AG4,(References!$L$20*-1),\" \")","v":" "},{"$f":"IF('Financial Input'!$I$19>=AH4,(References!$L$20*-1),\" \")","v":" "},{"$f":"IF('Financial Input'!$I$19>=AI4,(References!$L$20*-1),\" \")","v":" "},{"$f":"IF('Financial Input'!$I$19>=AJ4,(References!$L$20*-1),\" \")","v":" "},{"$f":"IF('Financial Input'!$I$19>=AK4,(References!$L$20*-1),\" \")","v":" "}]
[null,null,"Maintenance Costii",null,null,{"$f":"SUMIF(H4:AK4,\"<=\"&'Financial Input'!I8,H8:AK8)","v":0},{"$f":"SUM(H8:AAK8)","v":0},{"$f":"'Financial Input'!$I$20*-1","v":0},{"$f":"(((H8*-1)*(1+'Financial Input'!$R$8))*-1)","v":0},{"$f":"(((I8*-1)*(1+'Financial Input'!$R$8))*-1)","v":0},{"$f":"(((J8*-1)*(1+'Financial Input'!$R$8))*-1)","v":0},{"$f":"(((K8*-1)*(1+'Financial Input'!$R$8))*-1)","v":0},{"$f":"(((L8*-1)*(1+'Financial Input'!$R$8))*-1)","v":0},{"$f":"(((M8*-1)*(1+'Financial Input'!$R$8))*-1)","v":0},{"$f":"(((N8*-1)*(1+'Financial Input'!$R$8))*-1)","v":0},{"$f":"(((O8*-1)*(1+'Financial Input'!$R$8))*-1)","v":0},{"$f":"(((P8*-1)*(1+'Financial Input'!$R$8))*-1)","v":0},{"$f":"(((Q8*-1)*(1+'Financial Input'!$R$8))*-1)","v":0},{"$f":"(((R8*-1)*(1+'Financial Input'!$R$8))*-1)","v":0},{"$f":"(((S8*-1)*(1+'Financial Input'!$R$8))*-1)","v":0},{"$f":"(((T8*-1)*(1+'Financial Input'!$R$8))*-1)","v":0},{"$f":"(((U8*-1)*(1+'Financial Input'!$R$8))*-1)","v":0},{"$f":"(((V8*-1)*(1+'Financial Input'!$R$8))*-1)","v":0},{"$f":"(((W8*-1)*(1+'Financial Input'!$R$8))*-1)","v":0},{"$f":"(((X8*-1)*(1+'Financial Input'!$R$8))*-1)","v":0},{"$f":"(((Y8*-1)*(1+'Financial Input'!$R$8))*-1)","v":0},{"$f":"(((Z8*-1)*(1+'Financial Input'!$R$8))*-1)","v":0},{"$f":"(((AA8*-1)*(1+'Financial Input'!$R$8))*-1)","v":0},{"$f":"(((AB8*-1)*(1+'Financial Input'!$R$8))*-1)","v":0},{"$f":"(((AC8*-1)*(1+'Financial Input'!$R$8))*-1)","v":0},{"$f":"(((AD8*-1)*(1+'Financial Input'!$R$8))*-1)","v":0},{"$f":"(((AE8*-1)*(1+'Financial Input'!$R$8))*-1)","v":0},{"$f":"(((AF8*-1)*(1+'Financial Input'!$R$8))*-1)","v":0},{"$f":"(((AG8*-1)*(1+'Financial Input'!$R$8))*-1)","v":0},{"$f":"(((AH8*-1)*(1+'Financial Input'!$R$8))*-1)","v":0},{"$f":"(((AI8*-1)*(1+'Financial Input'!$R$8))*-1)","v":0},{"$f":"(((AJ8*-1)*(1+'Financial Input'!$R$8))*-1)","v":0}]
{"$rows_left_out":20}
{"sheet":"Background","index":7,"n_rows":29,"n_cols":9,"rows_kept":29,"cut":false,"hidden":true,"merged":[[2,2,2,7],[5,2,6,6],[28,2,29,6],[8,2,9,6],[27,2,27,4],[26,2,26,4],[25,2,25,8],[20,2,20,3],[21,2,21,3],[22,2,22,3]]}
[]
[]
[null,null,"Stormwater Retention Credit (SRC)\nFinancial Return Calculator\nRegulatory Review Division"]
[]
[null,null,"1. Is the project a voluntary or a regulated activity?",null,null,null,null,"Please Select  ",{"$f":"IF(Activity=\"Voluntary\",\"Voluntary\",IF(MS4_MLD=\"MSI\",\"MSI\",IF(MS4_MLD=\"MLD\",\"MLD\",\"\")))","v":"Voluntary"}]
[null,null,"    *If regulated, please distinguish between Major Land Disturbing\n      (MLD) activity or Major Substantial Improvement (MSI) activity.\n      The definition for these activities can be found in Appendix U of\n         the DOEE Stormwater Management Guidebook."]
[]
[]
{"$rows_left_out":22}
{"sheet":"References","index":8,"n_rows":216,"n_cols":32,"rows_kept":216,"cut":false,"hidden":true,"merged":[[59,0,59,1],[60,0,60,1]]}
["Green Roof","Extensive green roof","Intensive green roof",null,null,null,1,1,null,null,null,null,null,null,null,null,null,null,null,null,"Green Roof"]
["Rainwater Harvesting","Rainwater harvesting",null,null,2,"Rv to Sv Coversion factor",1,null,null,null,null,null,null,null,"Return to Instructions",null,"Continue",null,null,null,"Rainwater Harvesting"]
["Impervious Surface Disconnection","Disconnection to a pervious area","Disconnection to a conservation area","Disconnection to amended soils",null,null,{"$f":"(VLOOKUP(B3,BMPData,21,FALSE)/100)*2","v":{"$error":"#N/A"}},{"$f":"(VLOOKUP(C3,BMPData,21,FALSE)/100)*6","v":{"$error":"#N/A"}},{"$f":"(VLOOKUP(D3,BMPData,21,FALSE)/100)*4","v":{"$error":"#N/A"}},null,null,null,null,null,null,null,null,"Appendix U",null,null,"Permeable Pavement"]
["Permeable Pavement","Permeable pavement - Enhanced","Permeable pavement - Standard",null,null,null,1,{"$f":"(VLOOKUP(C4,PP,6,FALSE)/100)*5","v":{"$error":"#N/A"}},null,null,null,null,null,null,"Visit SRC Registry",null,"Go Back",null,"SRC Purchase Agreement",null,"Bioretention"]
["Bioretention","Bioretention - Enhanced","Bioretention - Standard",null,null,null,1,0.6,null,null,null,null,null,null,null,null,null,"AWDZ Map",null,null,"Infiltration"]
["Infiltration","Infiltration trench","Infiltration basin",null,null,null,1,1,null,null,null,null,null,null,"Visit SRC Homepage",null,"MS4 Map",null,null,null,"Open Channel"]
["Open Channel","Grass channel","Grass channel - amended soils","Dry swale","Wet swale",null,0.1,0.3,0.6,0.1,null,null,null,null,null,null,null,null,null,null,"Ponds"]
["Ponds","Micropool ED pond","Wet pond","Wet ED pond",null,null,0.1,0.1,0.1,null,null,null,null,null,"Match",null,"Match1",null,null,null,"Wetlands"]
{"$rows_left_out":209}
{"sheet":"Costs","index":9,"n_rows":118,"n_cols":20,"rows_kept":118,"cut":false,"hidden":true,"merged":[[116,1,116,2],[115,0,115,2],[113,0,113,2],[60,3,61,3],[60,1,60,2],[60,12,60,13],[60,10,60,11],[60,8,60,9],[60,6,60,7],[60,4,60,5]]}
["Source: cnet.org"]
["Cost Sheet"]
[null,"Construction Cost",null,null,null,null,"Maintenance Cost",null,null,"Component Lifespan"]
["Component","Range","Cost",null,"Source",null,"Range","Cost","Source","Range","Life","Source"]
["Green Roof","Low",8.75,"sq. ft.","Water Environment Research Federation Low Impact Development Best Management Practices Whole Life Cost Model 2007",null,"Low",null,"City of Portland, Bureau of Environmental Services Cost Benefit Evaluation of Ecoroofs 2008","Long","50.0 years","Water Environment Research Federation Low Impact Development Best Management Practices Whole Life Cost Model 2007"]
[null,"Mid",15.75,"sq. ft.","City of Portland, Bureau of Environmental Services Cost Benefit Evaluation of Ecoroofs 2008",null,"Mid","$0.025/sq. ft.","Low Impact Development Center, Inc.; Low Impact Development for Big Box Manufacturers November 2005 ","Mid","40.0 years","PlaNYC 2030 Sustainable Stormwater Management Plan Accessed March 2009 "]
[null,"High",31.8,"sq. ft.","Wetland Studies and Solutions, Inc.; Virginia LID at WSSI 2007 ",null,"High","$0.412/sq. ft.","Water Environment Research Federation Low Impact Development Best Management Practices Whole Life Cost Model 2007","Short","25.0 years","Low Impact Development Center, Inc.; Low Impact Development for Big Box Manufacturers November 2005 "]
["Permeable Pavement- Pavers","Low",5.3,"sq. ft.","Sikich, Andrew J. and Patrick D. Kelsey. \"The Morton Arboretum's \"Green\" Parking Lot.\" Accessed July 2005.",null,"Low",null,"Pelkonen, Peg. The Morton Arboretum Permeable Parking Lot Presentation at the US Cellular Field Lot L Paver Symposium April 8th, 2008","Long","50.0 years","Pelkonen, Peg. The Morton Arboretum Permeable Parking Lot Presentation at the US Cellular Field Lot L Paver Symposium April 8th, 2008"]
{"$rows_left_out":110}